{"text_format":"1","workbook":"xlsx","n_sheets":2,"sheets":["Contribution Report","Rate Lookup"],"not_rendered":{"charts":0,"images":0,"macros":1,"external_links":0,"defined_names":7,"comments":0,"pivot_tables":0},"unopened":[],"bounds":{"document_bytes":16777216,"sheet_cells":100000,"rows_first":2000,"rows_last":500,"rows_between":2000,"halvings":0,"cell_chars":16384,"cell_head_chars":4096},"cells_cut":0,"cells_raw":0,"read":"whole","date_system":"1900"}

{"sheet":"Contribution Report","index":0,"n_rows":221,"n_cols":9,"rows_kept":221,"cut":false,"hidden":false,"merged":[[193,0,193,1],[194,0,194,1],[217,0,217,1],[218,0,218,1],[219,0,219,1],[220,0,220,1],[208,0,208,1],[209,0,209,1],[210,0,210,1],[211,0,211,1],[212,0,212,1],[213,0,213,1],[214,0,214,1],[215,0,215,1],[216,0,216,1],[206,0,206,1],[207,0,207,1],[195,0,195,1],[196,0,196,1],[197,0,197,1],[198,0,198,1],[199,0,199,1],[200,0,200,1],[102,0,102,1],[103,0,103,1],[104,0,104,1],[105,0,105,1],[106,0,106,1],[107,0,107,1],[108,0,108,1],[109,0,109,1],[110,0,110,1],[93,0,93,1],[94,0,94,1],[95,0,95,1],[96,0,96,1],[97,0,97,1],[98,0,98,1],[99,0,99,1],[167,0,167,1],[168,0,168,1],[140,0,140,1],[141,0,141,1],[142,0,142,1],[143,0,143,1],[144,0,144,1],[145,0,145,1],[146,0,146,1],[147,0,147,1],[148,0,148,1],[136,0,136,1],[137,0,137,1],[138,0,138,1],[139,0,139,1],[118,0,118,1],[119,0,119,1],[170,0,170,1],[201,0,201,1],[202,0,202,1],[203,0,203,1],[204,0,204,1],[205,0,205,1],[177,0,177,1],[178,0,178,1],[179,0,179,1],[180,0,180,1],[181,0,181,1],[182,0,182,1],[183,0,183,1],[184,0,184,1],[185,0,185,1],[186,0,186,1],[187,0,187,1],[188,0,188,1],[189,0,189,1],[190,0,190,1],[191,0,191,1],[171,0,171,1],[172,0,172,1],[192,0,192,1],[128,0,128,1],[173,0,173,1],[174,0,174,1],[175,0,175,1],[176,0,176,1],[149,0,149,1],[150,0,150,1],[151,0,151,1],[152,0,152,1],[153,0,153,1],[154,0,154,1],[155,0,155,1],[156,0,156,1],[157,0,157,1],[158,0,158,1],[159,0,159,1],[160,0,160,1],[161,0,161,1],[162,0,162,1],[163,0,163,1],[164,0,164,1],[165,0,165,1],[166,0,166,1],[169,0,169,1],[85,0,85,1],[86,0,86,1],[129,0,129,1],[130,0,130,1],[131,0,131,1],[132,0,132,1],[133,0,133,1],[134,0,134,1],[135,0,135,1],[111,0,111,1],[112,0,112,1],[113,0,113,1],[114,0,114,1],[115,0,115,1],[116,0,116,1],[117,0,117,1],[120,0,120,1],[121,0,121,1],[122,0,122,1],[123,0,123,1],[124,0,124,1],[125,0,125,1],[126,0,126,1],[127,0,127,1],[87,0,87,1],[88,0,88,1],[89,0,89,1],[90,0,90,1],[91,0,91,1],[92,0,92,1],[100,0,100,1],[101,0,101,1],[69,0,69,1],[70,0,70,1],[71,0,71,1],[72,0,72,1],[73,0,73,1],[74,0,74,1],[75,0,75,1],[76,0,76,1],[77,0,77,1],[78,0,78,1],[79,0,79,1],[80,0,80,1],[81,0,81,1],[82,0,82,1],[83,0,83,1],[84,0,84,1],[60,0,60,1],[61,0,61,1],[62,0,62,1],[63,0,63,1],[64,0,64,1],[65,0,65,1],[66,0,66,1],[67,0,67,1],[68,0,68,1],[51,0,51,1],[52,0,52,1],[53,0,53,1],[54,0,54,1],[55,0,55,1],[56,0,56,1],[57,0,57,1],[58,0,58,1],[59,0,59,1],[50,0,50,1],[6,1,7,3],[8,1,9,3],[10,1,12,3],[13,1,14,3],[15,1,16,3],[38,0,38,1],[39,0,39,1],[40,0,40,1],[37,0,37,1],[36,1,36,3],[35,1,35,3],[17,1,18,3],[41,0,41,1],[42,0,42,1],[43,0,43,1],[44,0,44,1],[45,0,45,1],[46,0,46,1],[47,0,47,1],[48,0,48,1],[49,0,49,1],[4,0,4,8],[0,0,0,8],[1,0,1,8],[2,0,2,8],[6,4,6,8],[15,4,16,8],[26,0,32,3],[21,0,22,3],[33,1,33,3]]}
["EMPLOYERS COMBINED REPORT OF CONTRIBUTIONS FOR"]
["LISTED FUNDS OF LABORERS LOCAL 100 & 397"]
["Fund Office (314) 367-6555"]
[]
["CONTRIBUTIONS REMITTED AFTER THE 15TH OF THE MONTH ARE DELINQUENT.  PAYMENTS RECEIVED AFTER THE 20TH OF THE MONTH WILL BE SUBJECT TO A LIQUIDATED DAMAGES ASSESSMENT OF 10 PERCENT (10%) OF TOTAL CONTRIBUTIONS."]
[]
[null,null,null,null,{"$f":"IF(OR(ISBLANK(A25),ISBLANK(B25),ISBLANK(C25),ISBLANK(D25)),\"Invalid - Complete Reporting Data\",IF(A25=\"SIBA\",(\"SIBA \"&VLOOKUP(D25,'Rate Lookup'!$AF:$AG,2,FALSE)),IF(A25=\"Non-SIBA\",(\"Non-SIBA \"&VLOOKUP(D25,'Rate Lookup'!$AF:$AG,2,FALSE)),IF(A25=\"Masonry\",(\"Masonry \"&VLOOKUP(D25,'Rate Lookup'!$AF:$AG,2,FALSE)),IF(A25=\"National Distribution\",(\"NDA \"&VLOOKUP(D25,'Rate Lookup'!$AF:$AG,2,FALSE)),\"Invalid - Complete Reporting Data\")))))","v":"SIBA Rates Effective 8/1/2023"}]
["Employer:",null,null,null,null,"ST","TH","DT"]
[null,null,null,null,"Welfare",{"$f":"VLOOKUP($E$7,'Rate Lookup'!$A$3:$AD$50,3,FALSE)","v":8.6999999999999993},{"$f":"VLOOKUP($E$7,'Rate Lookup'!$A$3:$AD$50,4,FALSE)","v":13.049999999999999},{"$f":"VLOOKUP($E$7,'Rate Lookup'!$A$3:$AD$50,5,FALSE)","v":17.399999999999999}]
["Contact Name:",null,null,null,"Pension",{"$f":"VLOOKUP($E$7,'Rate Lookup'!$A$3:$AD$50,7,FALSE)","v":11.4},{"$f":"VLOOKUP($E$7,'Rate Lookup'!$A$3:$AD$50,8,FALSE)","v":17.100000000000001},{"$f":"VLOOKUP($E$7,'Rate Lookup'!$A$3:$AD$50,9,FALSE)","v":22.8}]
[null,null,null,null,"Annuity",{"$f":"VLOOKUP($E$7,'Rate Lookup'!$A$3:$AD$50,11,FALSE)","v":7.5},{"$f":"VLOOKUP($E$7,'Rate Lookup'!$A$3:$AD$50,12,FALSE)","v":11.25},{"$f":"VLOOKUP($E$7,'Rate Lookup'!$A$3:$AD$50,13,FALSE)","v":15}]
[null,null,null,null,"Training",{"$f":"VLOOKUP($E$7,'Rate Lookup'!$A$3:$AD$50,15,FALSE)","v":0.8},{"$f":"VLOOKUP($E$7,'Rate Lookup'!$A$3:$AD$50,15,FALSE)","v":0.8},{"$f":"VLOOKUP($E$7,'Rate Lookup'!$A$3:$AD$106,15,FALSE)","v":0.8}]
["Address:",null,null,null,"LECET Funds",{"$f":"VLOOKUP($E$7,'Rate Lookup'!$A$3:$AD$50,17,FALSE)","v":2.0099999999999998},{"$f":"VLOOKUP($E$7,'Rate Lookup'!$A$3:$AD$50,17,FALSE)","v":2.0099999999999998},{"$f":"VLOOKUP($E$7,'Rate Lookup'!$A$3:$AD$106,17,FALSE)","v":2.0099999999999998}]
[null,null,null,null,"Supp. Dues",{"$f":"IF(B25=\"No\",0,IF(C25=100,VLOOKUP($E$7,'Rate Lookup'!$A$3:$AD$50,19,FALSE),IF(A25=\"Non-SIBA\",VLOOKUP($E$7,'Rate Lookup'!$A$3:$AD$50,23,FALSE),VLOOKUP($E$7,'Rate Lookup'!$A$3:$AD$50,21,FALSE))))","v":0.6},{"$f":"IF(B25=\"No\",0,IF(C25=100,VLOOKUP($E$7,'Rate Lookup'!$A$3:$AD$50,19,FALSE),IF(A25=\"Non-SIBA\",VLOOKUP($E$7,'Rate Lookup'!$A$3:$AD$50,23,FALSE),VLOOKUP($E$7,'Rate Lookup'!$A$3:$AD$50,21,FALSE))))","v":0.6},{"$f":"IF(B25=\"No\",0,IF(C25=100,VLOOKUP($E$7,'Rate Lookup'!$A$3:$AD$50,19,FALSE),IF(A25=\"Non-SIBA\",VLOOKUP($E$7,'Rate Lookup'!$A$3:$AD$50,23,FALSE),VLOOKUP($E$7,'Rate Lookup'!$A$3:$AD$50,21,FALSE))))","v":0.6}]
[null,null,null,null,"Total",{"$f":"SUM(F9:F14)","v":31.010000000000005},{"$f":"SUM(G9:G14)","v":44.809999999999995},{"$f":"SUM(H9:H14)","v":58.61}]
[null,null,null,null,"Monthly Contribution Report Summary"]
["Phone Number:"]
[null,null,null,null,null,"ST","TH","DT"]
["Email:",null,null,null,"Total Hours",{"$f":"SUM(E39:E226)","v":0},{"$f":"SUM(F39:F226)","v":0},{"$f":"SUM(G39:G226)","v":0}]
[null,null,null,null," x Rate",{"$f":"F15","v":31.010000000000005},{"$f":"G15","v":44.809999999999995},{"$f":"H15","v":58.61}]
[null,null,null,null,"Total",{"$f":"ROUND(F19*F20,2)","v":0},{"$f":"ROUND(G19*G20,2)","v":0},{"$f":"ROUND(H19*H20,2)","v":0}]
["Reporting Data",null,null,null,null,null,null,"Subtotal:",{"$f":"SUM(F21:H21)","v":0}]
[null,null,null,null,null,null,null,"Liquidated Damages:"]
["Agreement Type","Supplement Dues","Work Jurisdiction","Reporting Period",null,null,null,"Adjustment:"]
["SIBA","Yes",397,"August, 2023",null,null,null,"Total Contribution Due:",{"$f":"+I24+I23+I22","v":0}]
[null,null,"(100 / 397)","(Month, Year)","Submit form electronically through:"]
["The undersigned employer, if not already a signator, hereby becomes a signatory party to the currently applicable collective bargaining agreement with Laborers Locals 100 & 397 covering the type and area of work of the below employees and also to each agreement and Declaration of Trust, and amendments, establishing the funds for which payment is made herewith.",null,null,null,null,"https://www.ekonbenefits.com/securesend"]
[null,null,null,null,"Payment Remittance"]
[null,null,null,null,"Option 1) ","By Automatic Transfer:"]
[null,null,null,null,null,"Select this option upon uploading form"]
[null,null,null,null,null,"Note: ACH Debit Authorization must be on file"]
[null,null,null,null,"Option 2)","By Check: "]
[null,null,null,null,null,"Pay to: Employers & Laborers Locals 100 & 397 Funds"]
["Print Name:",null,null,null,null,"Mail to: Ekon Benefits"]
[null,null,null,null,null,"4940 Washington Blvd."]
["Date: ",null,null,null,null,"St. Louis, MO  63108"]
[null,null,null,null,"Call Ekon Benefits at (314) 367-6555 with questions"]
["Name",null,"SSN","Home Local #  100/397","Straight Time Hours","Time & One-Half Hours","Double Time Hours","LPL (Withheld)","Checkoff (Withheld)"]
[null,null,null,null,null,null,null,{"$f":"IF(AND($E39=\"\",$F39=\"\",$G39=\"\"),\"\",(ROUND(SUM(E39:G39)*VLOOKUP($E$7,'Rate Lookup'!$A$3:$AD$50,25,FALSE),2)))","v":""},{"$f":"IF(AND($E39=\"\",$F39=\"\",$G39=\"\"),\"\",(ROUND(SUM(E39:G39)*VLOOKUP($E$7,'Rate Lookup'!$A$3:$AD$50,27,FALSE),2)))","v":""}]
[null,null,null,null,null,null,null,{"$f":"IF(AND($E40=\"\",$F40=\"\",$G40=\"\"),\"\",(ROUND(SUM(E40:G40)*VLOOKUP($E$7,'Rate Lookup'!$A$3:$AD$50,25,FALSE),2)))","v":""},{"$f":"IF(AND($E40=\"\",$F40=\"\",$G40=\"\"),\"\",(ROUND(SUM(E40:G40)*VLOOKUP($E$7,'Rate Lookup'!$A$3:$AD$50,27,FALSE),2)))","v":""}]
{"$rows_left_out":182}
{"sheet":"Rate Lookup","index":1,"n_rows":116,"n_cols":35,"rows_kept":116,"cut":false,"hidden":true,"merged":[[0,1,0,8]]}
["Data Needs entered","<<<<<<<      \"All Time\" entries are paid on hours worked     >>>>>>>"]
[null,null,"Straight Time","Time &   One-Half","Double Time",null,"Straight Time","Time &   One-Half","Double Time",null,"Straight Time","Time &   One-Half","Double Time",null,"All Time",null,"All Time",null,"All Time",null,"All Time",null,"All Time",null,"All Time",null,"All Time",null,null,null,null,"January, 2015","Rates Effective 8/1/2014",null,"Column1"]
["SIBA Rates Effective 8/1/2014","Welfare",7.1,{"$f":"ROUND(C3*1.5,2)","v":10.65},{"$f":"C3*2","v":14.2},"Pension",8.85,{"$f":"(G3*1.5)","v":13.274999999999999},{"$f":"G3*2","v":17.7},"Annuity",2.5499999999999998,{"$f":"ROUND(K3*1.5,2)","v":3.83},{"$f":"K3*2","v":5.0999999999999996},"Training",0.8,"LECET",1.22,"Dues 100",0.3,"Dues 397",0.2,"Dues 397 Non-SIBA","N/A","MW LPL",0.02,"Check-Off",0.5,null,null,null,null,"February, 2015","Rates Effective 8/1/2014",null,100]
["SIBA Rates Effective 8/1/2015","Welfare",7.4,{"$f":"ROUND(C4*1.5,2)","v":11.1},14.8,"Pension",9,13.5,18,"Annuity",2.8,{"$f":"ROUND(K4*1.5,2)","v":4.2},5.6,"Training",0.8,"LECET",1.22,"Dues 100",0.3,"Dues 397",0.2,"Dues 397 Non-SIBA","N/A","MW LPL",0.02,"Check-Off",0.5,null,null,null,null,"March, 2015","Rates Effective 8/1/2014",null,397]
["SIBA Rates Effective 8/1/2016","Welfare",8,{"$f":"ROUND(C5*1.5,2)","v":12},16,"Pension",9.25,13.875,18.5,"Annuity",3,{"$f":"ROUND(K5*1.5,2)","v":4.5},6,"Training",0.8,"LECET",1.28,"Dues 100",0.3,"Dues 397",0.2,"Dues 397 Non-SIBA","N/A","MW LPL",0.02,"Check-Off",0.55000000000000004,null,null,null,null,"April, 2015","Rates Effective 8/1/2014"]
["SIBA Rates Effective 8/1/2017","Welfare",8.25,{"$f":"(C6*1.5)","v":12.375},16.5,"Pension",9.75,14.625,19.5,"Annuity",3.65,{"$f":"(K6*1.5)","v":5.4749999999999996},7.3,"Training",0.8,"LECET",1.28,"Dues 100",0.3,"Dues 397",0.2,"Dues 397 Non-SIBA","N/A","MW LPL",0.02,"Check-Off",0.55000000000000004,null,null,null,null,"May, 2015","Rates Effective 8/1/2014",null,"Column1"]
["SIBA Rates Effective 8/1/2018","Welfare",8.25,12.375,16.5,"Pension",9.9,14.850000000000001,19.8,"Annuity",4.1500000000000004,6.2250000000000005,8.3000000000000007,"Training",0.8,"LECET",1.43,"Dues 100",0.3,"Dues 397",0.3,"Dues 397 Non-SIBA","N/A","MW LPL",0.02,"Check-Off",0.6,null,null,null,null,"June, 2015","Rates Effective 8/1/2014",null,"SIBA"]
["SIBA Rates Effective 8/1/2019","Welfare",8.3000000000000007,12.450000000000001,16.600000000000001,"Pension",10.4,15.600000000000001,20.8,"Annuity",4.5,6.75,9,"Training",0.8,"LECET",1.55,"Dues 100",0.3,"Dues 397",0.3,"Dues 397 Non-SIBA","N/A","MW LPL",0.02,"Check-Off",0.7,null,null,null,null,"July, 2015","Rates Effective 8/1/2014",null,"Non-SIBA"]
["SIBA Rates Effective 8/1/2020","Welfare",8.4499999999999993,12.674999999999999,{"$f":"C9*2","v":16.899999999999999},"Pension",10.9,{"$f":"(G9*1.5)","v":16.350000000000001},{"$f":"G9*2","v":21.8},"Annuity",5,7.5,{"$f":"K9*2","v":10},"Training",0.8,"LECET",1.55,"Dues 100",0.3,"Dues 397",0.5,"Dues 397 Non-SIBA","N/A","MW LPL",0.02,"Check-Off",0.7,null,null,null,null,"August, 2015","Rates Effective 8/1/2015",null,"Masonry"]
["SIBA Rates Effective 8/1/2021","Welfare",8.5500000000000007,12.825000000000001,{"$f":"C10*2","v":17.100000000000001},"Pension",11.4,{"$f":"(G10*1.5)","v":17.100000000000001},{"$f":"G10*2","v":22.8},"Annuity",5.5,8.25,{"$f":"K10*2","v":11},"Training",0.8,"LECET",1.65,"Dues 100",0.3,"Dues 397",0.6,"Dues 397 Non-SIBA","N/A","MW LPL",0.02,"Check-Off",0.72,null,null,null,null,"September, 2015","Rates Effective 8/1/2015"]
["SIBA Rates Effective 8/1/2022","Welfare",8.6,12.899999999999999,{"$f":"C11*2","v":17.2},"Pension",11.4,{"$f":"(G11*1.5)","v":17.100000000000001},{"$f":"G11*2","v":22.8},"Annuity",6.5,9.75,{"$f":"K11*2","v":13},"Training",0.8,"LECET",1.9,"Dues 100",0.3,"Dues 397",0.6,"Dues 397 Non-SIBA","N/A","MW LPL",0.02,"Check-Off",0.89,null,null,null,null,"October, 2015","Rates Effective 8/1/2015"]
["SIBA Rates Effective 8/1/2023","Welfare",8.6999999999999993,{"$f":"(C12*1.5)","v":13.049999999999999},{"$f":"C12*2","v":17.399999999999999},"Pension",11.4,{"$f":"(G12*1.5)","v":17.100000000000001},{"$f":"G12*2","v":22.8},"Annuity",7.5,{"$f":"(K12*1.5)","v":11.25},{"$f":"K12*2","v":15},"Training",0.8,"LECET",2.0099999999999998,"Dues 100",0.3,"Dues 397",0.6,"Dues 397 Non-SIBA","N/A","MW LPL",0.05,"Check-Off",0.92,null,null,null,null,"November, 2015","Rates Effective 8/1/2015"]
["Non-SIBA Rates Effective 8/1/2014","Welfare",{"$f":"C3","v":7.1},{"$f":"ROUND(C13*1.5,2)","v":10.65},14.2,"Pension",{"$f":"G3","v":8.85},13.274999999999999,17.7,"Annuity",{"$f":"K3","v":2.5499999999999998},{"$f":"ROUND(K13*1.5,2)","v":3.83},5.0999999999999996,"Training",{"$f":"O3","v":0.8},"LECET",1.1200000000000001,"Dues 100",{"$f":"S3","v":0.3},"Dues 397","N/A","Dues 397 Non-SIBA",0.3,"MW LPL",{"$f":"Y3","v":0.02},"Check-Off",0.5,null,null,null,null,"December, 2015","Rates Effective 8/1/2015",null,"Yes"]
["Non-SIBA Rates Effective 8/1/2015","Welfare",7.4,{"$f":"ROUND(C14*1.5,2)","v":11.1},14.8,"Pension",9,13.5,18,"Annuity",2.8,{"$f":"ROUND(K14*1.5,2)","v":4.2},5.6,"Training",0.8,"LECET",1.1200000000000001,"Dues 100",0.3,"Dues 397","N/A","Dues 397 Non-SIBA",0.3,"MW LPL",0.02,"Check-Off",0.5,null,null,null,null,"January, 2016","Rates Effective 8/1/2015",null,"No"]
["Non-SIBA Rates Effective 8/1/2016","Welfare",8,{"$f":"ROUND(C15*1.5,2)","v":12},16,"Pension",9.25,13.875,18.5,"Annuity",3,{"$f":"ROUND(K15*1.5,2)","v":4.5},6,"Training",0.8,"LECET",1.18,"Dues 100",0.3,"Dues 397","N/A","Dues 397 Non-SIBA",0.3,"MW LPL",0.02,"Check-Off",0.55000000000000004,null,null,null,null,"February, 2016","Rates Effective 8/1/2015"]
["Non-SIBA Rates Effective 8/1/2017","Welfare",8.25,{"$f":"(C16*1.5)","v":12.375},16.5,"Pension",9.75,14.625,19.5,"Annuity",3.65,{"$f":"(K16*1.5)","v":5.4749999999999996},7.3,"Training",0.8,"LECET",1.18,"Dues 100",0.3,"Dues 397","N/A","Dues 397 Non-SIBA",0.3,"MW LPL",0.02,"Check-Off",0.55000000000000004,null,null,null,null,"March, 2016","Rates Effective 8/1/2015"]
["Non-SIBA Rates Effective 8/1/2018","Welfare",8.25,12.375,16.5,"Pension",9.9,14.850000000000001,19.8,"Annuity",4.1500000000000004,6.2250000000000005,8.3000000000000007,"Training",0.8,"LECET",1.33,"Dues 100",0.3,"Dues 397","N/A","Dues 397 Non-SIBA",0.4,"MW LPL",0.02,"Check-Off",0.6,null,null,null,null,"April, 2016","Rates Effective 8/1/2015"]
["Non-SIBA Rates Effective 8/1/2019","Welfare",8.3000000000000007,12.450000000000001,16.600000000000001,"Pension",10.4,15.600000000000001,20.8,"Annuity",4.5,6.75,9,"Training",0.8,"LECET",1.45,"Dues 100",0.3,"Dues 397","N/A","Dues 397 Non-SIBA",0.4,"MW LPL",0.02,"Check-Off",0.7,null,null,null,null,"May, 2016","Rates Effective 8/1/2015"]
["Non-SIBA Rates Effective 8/1/2020","Welfare",8.4499999999999993,12.674999999999999,16.899999999999999,"Pension",10.9,16.350000000000001,21.8,"Annuity",5,7.5,10,"Training",0.8,"LECET",1.45,"Dues 100",0.3,"Dues 397","N/A","Dues 397 Non-SIBA",0.6,"MW LPL",0.02,"Check-Off",0.7,null,null,null,null,"June, 2016","Rates Effective 8/1/2015"]
["Non-SIBA Rates Effective 8/1/2021","Welfare",8.5500000000000007,12.825000000000001,17.100000000000001,"Pension",11.4,17.100000000000001,22.8,"Annuity",5.5,8.25,11,"Training",0.8,"LECET",1.55,"Dues 100",0.3,"Dues 397","N/A","Dues 397 Non-SIBA",0.7,"MW LPL",0.02,"Check-Off",0.72,null,null,null,null,"July, 2016","Rates Effective 8/1/2015"]
["Non-SIBA Rates Effective 8/1/2022","Welfare",8.6,12.899999999999999,17.2,"Pension",11.4,17.100000000000001,22.8,"Annuity",6.5,9.75,13,"Training",0.8,"LECET",1.75,"Dues 100",0.3,"Dues 397","N/A","Dues 397 Non-SIBA",0.75,"MW LPL",0.02,"Check-Off",0.89,null,null,null,null,"August, 2016","Rates Effective 8/1/2016"]
["Non-SIBA Rates Effective 8/1/2023","Welfare",8.6999999999999993,13.049999999999999,{"$f":"C22*2","v":17.399999999999999},"Pension",11.4,{"$f":"(G22*1.5)","v":17.100000000000001},{"$f":"G22*2","v":22.8},"Annuity",7.5,11.25,{"$f":"K22*2","v":15},"Training",0.8,"LECET",1.86,"Dues 100",0.3,"Dues 397","N/A","Dues 397 Non-SIBA",0.75,"MW LPL",0.05,"Check-Off",0.92,null,null,null,null,"September, 2016","Rates Effective 8/1/2016"]
["Masonry Rates Effective 8/1/2014","Welfare",{"$f":"C3","v":7.1},{"$f":"ROUND(C23*1.5,2)","v":10.65},14.2,"Pension",{"$f":"G3","v":8.85},13.274999999999999,17.7,"Annuity",{"$f":"K3","v":2.5499999999999998},{"$f":"ROUND(K23*1.5,2)","v":3.83},5.0999999999999996,"Training",{"$f":"O3","v":0.8},"LECET",1.17,"Dues 100",{"$f":"S3","v":0.3},"Dues 397",{"$f":"U3","v":0.2},"Dues 397 Non-SIBA","N/A","MW LPL",{"$f":"Y3","v":0.02},"Check-Off",0.5,null,null,null,null,"October, 2016","Rates Effective 8/1/2016"]
["Masonry Rates Effective 8/1/2015","Welfare",7.4,{"$f":"ROUND(C24*1.5,2)","v":11.1},14.8,"Pension",9,13.5,18,"Annuity",2.8,{"$f":"ROUND(K24*1.5,2)","v":4.2},5.6,"Training",0.8,"LECET",1.17,"Dues 100",0.3,"Dues 397",0.2,"Dues 397 Non-SIBA","N/A","MW LPL",0.02,"Check-Off",0.5,null,null,null,null,"November, 2016","Rates Effective 8/1/2016"]
["Masonry Rates Effective 8/1/2016","Welfare",8,{"$f":"ROUND(C25*1.5,2)","v":12},16,"Pension",9.25,13.875,18.5,"Annuity",3,{"$f":"ROUND(K25*1.5,2)","v":4.5},6,"Training",0.8,"LECET",1.33,"Dues 100",0.3,"Dues 397",0.2,"Dues 397 Non-SIBA","N/A","MW LPL",0.02,"Check-Off",0.55000000000000004,null,null,null,null,"December, 2016","Rates Effective 8/1/2016"]
["Masonry Rates Effective 8/1/2017","Welfare",8.25,{"$f":"(C26*1.5)","v":12.375},16.5,"Pension",9.75,14.625,19.5,"Annuity",3.65,{"$f":"(K26*1.5)","v":5.4749999999999996},7.3,"Training",0.8,"LECET",1.33,"Dues 100",0.3,"Dues 397",0.2,"Dues 397 Non-SIBA","N/A","MW LPL",0.02,"Check-Off",0.55000000000000004,null,null,null,null,"January, 2017","Rates Effective 8/1/2016"]
["Masonry Rates Effective 8/1/2018","Welfare",8.25,12.375,16.5,"Pension",9.9,14.850000000000001,19.8,"Annuity",4.1500000000000004,6.2250000000000005,8.3000000000000007,"Training",0.8,"LECET",1.48,"Dues 100",0.3,"Dues 397",0.3,"Dues 397 Non-SIBA","N/A","MW LPL",0.02,"Check-Off",0.6,null,null,null,null,"February, 2017","Rates Effective 8/1/2016"]
["Masonry Rates Effective 8/1/2019","Welfare",8.3000000000000007,12.450000000000001,16.600000000000001,"Pension",10.4,15.600000000000001,20.8,"Annuity",4.5,6.75,9,"Training",0.8,"LECET",1.6,"Dues 100",0.3,"Dues 397",0.3,"Dues 397 Non-SIBA","N/A","MW LPL",0.02,"Check-Off",0.7,null,null,null,null,"March, 2017","Rates Effective 8/1/2016"]
["Masonry Rates Effective 8/1/2020","Welfare",8.4499999999999993,12.674999999999999,16.899999999999999,"Pension",10.9,16.350000000000001,21.8,"Annuity",5,7.5,10,"Training",0.8,"LECET",1.6,"Dues 100",0.3,"Dues 397",0.5,"Dues 397 Non-SIBA","N/A","MW LPL",0.02,"Check-Off",0.7,null,null,null,null,"April, 2017","Rates Effective 8/1/2016"]
["Masonry Rates Effective 8/1/2021","Welfare",8.5500000000000007,12.825000000000001,17.100000000000001,"Pension",11.4,17.100000000000001,22.8,"Annuity",5.5,8.25,11,"Training",0.8,"LECET",1.7,"Dues 100",0.3,"Dues 397",0.6,"Dues 397 Non-SIBA","N/A","MW LPL",0.02,"Check-Off",0.72,null,null,null,null,"May, 2017","Rates Effective 8/1/2016"]
["Masonry Rates Effective 8/1/2022","Welfare",8.6,12.899999999999999,17.2,"Pension",11.4,17.100000000000001,22.8,"Annuity",6.5,9.75,13,"Training",0.8,"LECET",1.9,"Dues 100",0.3,"Dues 397",0.6,"Dues 397 Non-SIBA","N/A","MW LPL",0.02,"Check-Off",0.89,null,null,null,null,"June, 2017","Rates Effective 8/1/2016"]
["Masonry Rates Effective 8/1/2023","Welfare",8.6999999999999993,13.049999999999999,17.399999999999999,"Pension",11.4,17.100000000000001,22.8,"Annuity",7.5,11.25,15,"Training",0.8,"LECET",2.0099999999999998,"Dues 100",0.3,"Dues 397",0.6,"Dues 397 Non-SIBA","N/A","MW LPL",0.05,"Check-Off",0.92,null,null,null,null,"July, 2017","Rates Effective 8/1/2016"]
[null,null,null,null,null,null,null,null,null,null,null,null,null,null,null,null,null,null,null,null,null,null,null,null,null,null,null,null,null,null,null,"October, 2016","Rates Effective 8/1/2016"]
[null,null,null,null,null,null,null,null,null,null,null,null,null,null,null,null,null,null,null,null,null,null,null,null,null,null,null,null,null,null,null,"November, 2016","Rates Effective 8/1/2016"]
[null,null,null,null,null,null,null,null,null,null,null,null,null,null,null,null,null,null,null,null,null,null,null,null,null,null,null,null,null,null,null,"December, 2016","Rates Effective 8/1/2016"]
[null,null,null,null,null,null,null,null,null,null,null,null,null,null,null,null,null,null,null,null,null,null,null,null,null,null,null,null,null,null,null,"January, 2017","Rates Effective 8/1/2016"]
[null,null,null,null,null,null,null,null,null,null,null,null,null,null,null,null,null,null,null,null,null,null,null,null,null,null,null,null,null,null,null,"February, 2017","Rates Effective 8/1/2016"]
[null,null,null,null,null,null,null,null,null,null,null,null,null,null,null,null,null,null,null,null,null,null,null,null,null,null,null,null,null,null,null,"March, 2017","Rates Effective 8/1/2016"]
[null,null,null,null,null,null,null,null,null,null,null,null,null,null,null,null,null,null,null,null,null,null,null,null,null,null,null,null,null,null,null,"April, 2017","Rates Effective 8/1/2016"]
[null,null,null,null,null,null,null,null,null,null,null,null,null,null,null,null,null,null,null,null,null,null,null,null,null,null,null,null,null,null,null,"May, 2017","Rates Effective 8/1/2016"]
{"$rows_left_out":76}